{"text_format":"1","workbook":"xlsx","n_sheets":2,"sheets":["元データ","座表"],"not_rendered":{"charts":0,"images":0,"macros":1,"external_links":1,"defined_names":3,"comments":0,"pivot_tables":0},"unopened":[],"bounds":{"document_bytes":16777216,"sheet_cells":100000,"rows_first":2000,"rows_last":500,"rows_between":2000,"halvings":0,"cell_chars":16384,"cell_head_chars":4096},"cells_cut":0,"cells_raw":0,"read":"whole","date_system":"1900"}

{"sheet":"元データ","index":0,"n_rows":137,"n_cols":14,"rows_kept":137,"cut":false,"hidden":false,"merged":[]}
[4,"年",1,2,3,4,5,6,7,8,9,10,11,12]
["組","番","組番","氏名","性別","ふりがな","住所","googleMap","電話番号"]
[1,1,{"$f":"IF(B3=\"\",\"\",A3*100+B3)","v":101},"安藤　ひろし","男",{"$f":"PHONETIC(D3)","v":"アンドウ　ヒロシ"},null,{"$f":"HYPERLINK(\"http://maps.google.co.jp/maps/place/\"&G3,\"Map\")","v":"Map"}]
[1,2,{"$f":"IF(B4=\"\",\"\",A4*100+B4)","v":102},"伊波　かなこ","女",{"$f":"PHONETIC(D4)","v":"イハ　カナコ"},null,{"$f":"HYPERLINK(\"http://maps.google.co.jp/maps/place/\"&G4,\"Map\")","v":"Map"}]
[1,3,103,"上島　ひでこ","女","ウエジマ　ヒデコ",null,"Map"]
[1,4,104,"小川　ももこ","女","オガワ　モモコ",null,"Map"]
[1,5,105,"加藤　りさこ","女","カトウ　リサコ",null,"Map"]
[1,6,106,"金子　ちから","男","カネコ　チカラ",null,"Map"]
[1,7,107,"木田　ゆうじ","男","キダ　ユウジ",null,"Map"]
[1,8,108,"木村　たけこ","女","キムラ　タケコ",null,"Map"]
[1,9,109,"工藤　はなこ","女","クドウ　ハナコ",null,"Map"]
[1,10,110,"煙巻　そのこ","女","ケムマ　ソノコ",null,"Map"]
[1,11,111,"近藤　ゆいこ","女","コンドウ　ユイコ",null,"Map"]
[1,12,112,"佐藤　はると","男","サトウ　ハルト",null,"Map"]
[1,13,113,"重永　ともこ","女","シゲナガ　トモコ",null,"Map"]
[1,14,114,"須藤　はやと","男","スドウ　ハヤト",null,"Map"]
[1,15,115,"白石　りきと","男","シライシ　リキト",null,"Map"]
[1,16,116,"竹内　さちこ","女","タケウチ　サチコ",null,"Map"]
[1,17,117,"田中　ゆめこ","女","タナカ　ユメコ",null,"Map"]
[1,18,118,"土田　かおる","女","ツチダ　カオル",null,"Map"]
[1,19,119,"中村　かおり","男","ナカムラ　カオリ",null,"Map"]
[1,20,120,"新沼　けんた","男","ニイヌマ　ケンタ",null,"Map"]
[1,21,121,"野口　ゆい","女","ノグチ　ユイ",null,"Map"]
[1,22,122,"林　そのこ","女","ハヤシ　ソノコ",null,{"$f":"HYPERLINK(\"http://maps.google.co.jp/maps/place/\"&G24,\"Map\")","v":"Map"}]
[1,23,123,"平山　あゆ","女","ヒラヤマ　アユ",null,"Map"]
[1,24,124,"藤木　ゆい","女","フジキ　ユイ",null,{"$f":"HYPERLINK(\"http://maps.google.co.jp/maps/place/\"&G27,\"Map\")","v":"Map"}]
[1,25,125,"本庄　さとる","男","ホンジョウ　サトル",null,"Map"]
[1,26,126,"松永　とおる","男","マツナガ　トオル",null,"Map"]
[1,27,127,"三島　けいこ","女","ミシマ　ケイコ",null,"Map"]
[1,28,128,"武藤　かい","男","ムトウ　カイ",null,"Map"]
{"$rows_left_out":108}
{"sheet":"座表","index":1,"n_rows":62,"n_cols":29,"rows_kept":62,"cut":false,"hidden":false,"merged":[[2,3,3,4],[2,9,4,13],[2,18,3,19],[4,18,4,19],[5,1,27,1],[5,21,27,21],[7,3,7,4],[7,6,7,7],[7,9,7,10],[7,12,7,13],[7,15,7,16],[7,18,7,19],[8,3,8,4],[8,6,8,7],[10,18,10,19],[11,3,11,4],[11,6,11,7],[11,9,11,10],[11,12,11,13],[11,15,11,16],[11,18,11,19],[8,9,8,10],[8,12,8,13],[8,15,8,16],[8,18,8,19],[10,3,10,4],[10,6,10,7],[10,9,10,10],[10,12,10,13],[10,15,10,16],[14,3,14,4],[14,6,14,7],[14,9,14,10],[14,12,14,13],[14,15,14,16],[14,18,14,19],[13,3,13,4],[13,6,13,7],[13,9,13,10],[13,12,13,13],[13,15,13,16],[13,18,13,19],[16,3,16,4],[16,6,16,7],[16,9,16,10],[16,12,16,13],[16,15,16,16],[16,18,16,19],[17,3,17,4],[17,6,17,7],[17,9,17,10],[17,12,17,13],[17,15,17,16],[17,18,17,19],[19,3,19,4],[19,6,19,7],[19,9,19,10],[19,12,19,13],[19,15,19,16],[19,18,19,19],[22,3,22,4],[22,6,22,7],[22,9,22,10],[22,12,22,13],[22,15,22,16],[22,18,22,19],[20,3,20,4],[20,6,20,7],[20,9,20,10],[20,12,20,13],[20,15,20,16],[20,18,20,19],[25,3,25,4],[25,6,25,7],[25,9,25,10],[25,12,25,13],[25,15,25,16],[25,18,25,19],[23,3,23,4],[23,6,23,7],[23,9,23,10],[23,12,23,13],[23,15,23,16],[23,18,23,19],[28,9,29,13],[28,18,28,19],[29,18,29,19],[30,3,30,7],[34,3,35,4],[34,9,36,13],[34,18,35,19],[36,18,36,19],[26,3,26,4],[26,6,26,7],[26,9,26,10],[26,12,26,13],[26,15,26,16],[26,18,26,19],[37,1,59,1],[37,21,59,21],[39,3,39,4],[39,6,39,7],[39,9,39,10],[39,12,39,13],[39,15,39,16],[39,18,39,19],[40,3,40,4],[40,6,40,7],[40,9,40,10],[40,12,40,13],[40,15,40,16],[40,18,40,19],[42,3,42,4],[42,6,42,7],[42,9,42,10],[42,12,42,13],[42,15,42,16],[42,18,42,19],[45,3,45,4],[45,6,45,7],[45,9,45,10],[45,12,45,13],[45,15,45,16],[45,18,45,19],[43,3,43,4],[43,6,43,7],[43,9,43,10],[43,12,43,13],[43,15,43,16],[43,18,43,19],[48,3,48,4],[48,6,48,7],[48,9,48,10],[48,12,48,13],[48,15,48,16],[48,18,48,19],[46,3,46,4],[46,6,46,7],[46,9,46,10],[46,12,46,13],[46,15,46,16],[46,18,46,19],[51,3,51,4],[51,6,51,7],[51,9,51,10],[51,12,51,13],[51,15,51,16],[51,18,51,19],[49,3,49,4],[49,6,49,7],[49,9,49,10],[49,12,49,13],[49,15,49,16],[49,18,49,19],[54,3,54,4],[54,6,54,7],[54,9,54,10],[54,12,54,13],[54,15,54,16],[54,18,54,19],[52,3,52,4],[52,6,52,7],[52,9,52,10],[52,12,52,13],[52,15,52,16],[52,18,52,19],[57,3,57,4],[57,6,57,7],[57,9,57,10],[57,12,57,13],[57,15,57,16],[57,18,57,19],[55,3,55,4],[55,6,55,7],[55,9,55,10],[55,12,55,13],[55,15,55,16],[55,18,55,19],[60,9,61,13],[60,18,60,19],[61,18,61,19],[62,3,62,7],[58,3,58,4],[58,6,58,7],[58,9,58,10],[58,12,58,13],[58,15,58,16],[58,18,58,19]]}
[]
[null,null,null,null,null,null,null,null,null,null,null,null,null,null,null,null,null,null,null,null,null,null,null,"年","組","クラス担任"]
[null,null,null,"クラス座席表",null,null,null,null,null,{"$f":"$X$3&\"年\"&$Y$3&\"組・座席表\"","v":"4年1組・座席表"},null,null,null,null,null,"在籍人数",{"$f":"COUNTIF(元データ!A:A,$Y$3)","v":30},null,{"$f":"TODAY()","v":"2022-06-21"},null,null,null,null,4,1]
[null,null,null,null,null,null,null,null,null,null,null,null,null,null,null,"男",{"$f":"COUNTIFS(元データ!A:A,$Y$3,元データ!E:E,$P4)","v":12},null,null,null,null,null,null,null,null,null,2,3,4]
[null,null,null,null,null,null,null,null,null,null,null,null,null,null,null,"女",{"$f":"COUNTIFS(元データ!A:A,$Y$3,元データ!E:E,$P5)","v":18},null,"開始日",null,null,null,null,"組","番","組番","氏名","性別","ふりがな"]
[null,"廊下",null,null,null,null,null,null,null,null,null,null,null,null,null,null,null,null,null,null,null,"窓",null,{"$f":"$Y$3","v":1},1,{"$f":"X6*100+Y6","v":101},{"$f":"VLOOKUP(座表!$Z6,[0]!all,AA$4,FALSE)","v":"安藤　ひろし"},{"$f":"VLOOKUP(座表!$Z6,[0]!all,AB$4,FALSE)","v":"男"},{"$f":"VLOOKUP(座表!$Z6,[0]!all,AC$4,FALSE)","v":"アンドウ　ヒロシ"}]
[null,null,null,1,{"$f":"IFERROR(VLOOKUP(D7,$Y$6:$AC$50,4,FALSE),\"\")","v":"男"},null,2,{"$f":"IFERROR(VLOOKUP(G7,$Y$6:$AC$50,4,FALSE),\"\")","v":"女"},null,3,{"$f":"IFERROR(VLOOKUP(J7,$Y$6:$AC$50,4,FALSE),\"\")","v":"女"},null,4,{"$f":"IFERROR(VLOOKUP(M7,$Y$6:$AC$50,4,FALSE),\"\")","v":"女"},null,5,{"$f":"IFERROR(VLOOKUP(P7,$Y$6:$AC$50,4,FALSE),\"\")","v":"女"},null,6,{"$f":"IFERROR(VLOOKUP(S7,$Y$6:$AC$50,4,FALSE),\"\")","v":"男"},null,null,null,{"$f":"$Y$3","v":1},2,{"$f":"X7*100+Y7","v":102},{"$f":"VLOOKUP(座表!$Z7,[0]!all,AA$4,FALSE)","v":"伊波　かなこ"},{"$f":"VLOOKUP(座表!$Z7,[0]!all,AB$4,FALSE)","v":"女"},{"$f":"VLOOKUP(座表!$Z7,[0]!all,AC$4,FALSE)","v":"イハ　カナコ"}]
[null,null,null,{"$f":"IFERROR(VLOOKUP(D7,$Y$6:$AC$50,3,FALSE),\"\")","v":"安藤　ひろし"},{"$f":"VLOOKUP($D$22,$Y$6:$AC$50,4,FALSE)","v":{"$error":"#N/A"}},null,{"$f":"IFERROR(VLOOKUP(G7,$Y$6:$AC$50,3,FALSE),\"\")","v":"伊波　かなこ"},{"$f":"VLOOKUP($D$22,$Y$6:$AC$50,4,FALSE)","v":{"$error":"#N/A"}},null,{"$f":"IFERROR(VLOOKUP(J7,$Y$6:$AC$50,3,FALSE),\"\")","v":"上島　ひでこ"},{"$f":"VLOOKUP($D$22,$Y$6:$AC$50,4,FALSE)","v":{"$error":"#N/A"}},null,{"$f":"IFERROR(VLOOKUP(M7,$Y$6:$AC$50,3,FALSE),\"\")","v":"小川　ももこ"},{"$f":"VLOOKUP($D$22,$Y$6:$AC$50,4,FALSE)","v":{"$error":"#N/A"}},null,{"$f":"IFERROR(VLOOKUP(P7,$Y$6:$AC$50,3,FALSE),\"\")","v":"加藤　りさこ"},{"$f":"VLOOKUP($D$22,$Y$6:$AC$50,4,FALSE)","v":{"$error":"#N/A"}},null,{"$f":"IFERROR(VLOOKUP(S7,$Y$6:$AC$50,3,FALSE),\"\")","v":"金子　ちから"},{"$f":"VLOOKUP($D$22,$Y$6:$AC$50,4,FALSE)","v":{"$error":"#N/A"}},null,null,null,1,3,103,{"$f":"VLOOKUP(座表!$Z8,[0]!all,AA$4,FALSE)","v":"上島　ひでこ"},{"$f":"VLOOKUP(座表!$Z8,[0]!all,AB$4,FALSE)","v":"女"},{"$f":"VLOOKUP(座表!$Z8,[0]!all,AC$4,FALSE)","v":"ウエジマ　ヒデコ"}]
[null,null,null,{"$f":"IFERROR(VLOOKUP(D7,$Y$6:$AC$50,5,FALSE),\"\")","v":"アンドウ　ヒロシ"},{"$error":"#N/A"},null,{"$f":"IFERROR(VLOOKUP(G7,$Y$6:$AC$50,5,FALSE),\"\")","v":"イハ　カナコ"},{"$error":"#N/A"},null,{"$f":"IFERROR(VLOOKUP(J7,$Y$6:$AC$50,5,FALSE),\"\")","v":"ウエジマ　ヒデコ"},{"$error":"#N/A"},null,{"$f":"IFERROR(VLOOKUP(M7,$Y$6:$AC$50,5,FALSE),\"\")","v":"オガワ　モモコ"},{"$error":"#N/A"},null,{"$f":"IFERROR(VLOOKUP(P7,$Y$6:$AC$50,5,FALSE),\"\")","v":"カトウ　リサコ"},{"$error":"#N/A"},null,{"$f":"IFERROR(VLOOKUP(S7,$Y$6:$AC$50,5,FALSE),\"\")","v":"カネコ　チカラ"},{"$error":"#N/A"},null,null,null,1,4,104,{"$f":"VLOOKUP(座表!$Z9,[0]!all,AA$4,FALSE)","v":"小川　ももこ"},{"$f":"VLOOKUP(座表!$Z9,[0]!all,AB$4,FALSE)","v":"女"},{"$f":"VLOOKUP(座表!$Z9,[0]!all,AC$4,FALSE)","v":"オガワ　モモコ"}]
[null,null,null,7,{"$f":"IFERROR(VLOOKUP(D10,$Y$6:$AC$50,4,FALSE),\"\")","v":"男"},null,8,{"$f":"IFERROR(VLOOKUP(G10,$Y$6:$AC$50,4,FALSE),\"\")","v":"女"},null,9,{"$f":"IFERROR(VLOOKUP(J10,$Y$6:$AC$50,4,FALSE),\"\")","v":"女"},null,10,{"$f":"IFERROR(VLOOKUP(M10,$Y$6:$AC$50,4,FALSE),\"\")","v":"女"},null,11,{"$f":"IFERROR(VLOOKUP(P10,$Y$6:$AC$50,4,FALSE),\"\")","v":"女"},null,12,{"$f":"IFERROR(VLOOKUP(S10,$Y$6:$AC$50,4,FALSE),\"\")","v":"男"},null,null,null,1,5,105,{"$f":"VLOOKUP(座表!$Z10,[0]!all,AA$4,FALSE)","v":"加藤　りさこ"},{"$f":"VLOOKUP(座表!$Z10,[0]!all,AB$4,FALSE)","v":"女"},{"$f":"VLOOKUP(座表!$Z10,[0]!all,AC$4,FALSE)","v":"カトウ　リサコ"}]
[null,null,null,{"$f":"IFERROR(VLOOKUP(D10,$Y$6:$AC$50,3,FALSE),\"\")","v":"木田　ゆうじ"},{"$f":"VLOOKUP($D$22,$Y$6:$AC$50,4,FALSE)","v":{"$error":"#N/A"}},null,{"$f":"IFERROR(VLOOKUP(G10,$Y$6:$AC$50,3,FALSE),\"\")","v":"木村　たけこ"},{"$f":"VLOOKUP($D$22,$Y$6:$AC$50,4,FALSE)","v":{"$error":"#N/A"}},null,{"$f":"IFERROR(VLOOKUP(J10,$Y$6:$AC$50,3,FALSE),\"\")","v":"工藤　はなこ"},{"$f":"VLOOKUP($D$22,$Y$6:$AC$50,4,FALSE)","v":{"$error":"#N/A"}},null,{"$f":"IFERROR(VLOOKUP(M10,$Y$6:$AC$50,3,FALSE),\"\")","v":"煙巻　そのこ"},{"$f":"VLOOKUP($D$22,$Y$6:$AC$50,4,FALSE)","v":{"$error":"#N/A"}},null,{"$f":"IFERROR(VLOOKUP(P10,$Y$6:$AC$50,3,FALSE),\"\")","v":"近藤　ゆいこ"},{"$f":"VLOOKUP($D$22,$Y$6:$AC$50,4,FALSE)","v":{"$error":"#N/A"}},null,{"$f":"IFERROR(VLOOKUP(S10,$Y$6:$AC$50,3,FALSE),\"\")","v":"佐藤　はると"},{"$f":"VLOOKUP($D$22,$Y$6:$AC$50,4,FALSE)","v":{"$error":"#N/A"}},null,null,null,1,6,106,{"$f":"VLOOKUP(座表!$Z11,[0]!all,AA$4,FALSE)","v":"金子　ちから"},{"$f":"VLOOKUP(座表!$Z11,[0]!all,AB$4,FALSE)","v":"男"},{"$f":"VLOOKUP(座表!$Z11,[0]!all,AC$4,FALSE)","v":"カネコ　チカラ"}]
[null,null,null,{"$f":"IFERROR(VLOOKUP(D10,$Y$6:$AC$50,5,FALSE),\"\")","v":"キダ　ユウジ"},{"$error":"#N/A"},null,{"$f":"IFERROR(VLOOKUP(G10,$Y$6:$AC$50,5,FALSE),\"\")","v":"キムラ　タケコ"},{"$error":"#N/A"},null,{"$f":"IFERROR(VLOOKUP(J10,$Y$6:$AC$50,5,FALSE),\"\")","v":"クドウ　ハナコ"},{"$error":"#N/A"},null,{"$f":"IFERROR(VLOOKUP(M10,$Y$6:$AC$50,5,FALSE),\"\")","v":"ケムマ　ソノコ"},{"$error":"#N/A"},null,{"$f":"IFERROR(VLOOKUP(P10,$Y$6:$AC$50,5,FALSE),\"\")","v":"コンドウ　ユイコ"},{"$error":"#N/A"},null,{"$f":"IFERROR(VLOOKUP(S10,$Y$6:$AC$50,5,FALSE),\"\")","v":"サトウ　ハルト"},{"$error":"#N/A"},null,null,null,1,7,107,{"$f":"VLOOKUP(座表!$Z12,[0]!all,AA$4,FALSE)","v":"木田　ゆうじ"},{"$f":"VLOOKUP(座表!$Z12,[0]!all,AB$4,FALSE)","v":"男"},{"$f":"VLOOKUP(座表!$Z12,[0]!all,AC$4,FALSE)","v":"キダ　ユウジ"}]
[null,null,null,13,{"$f":"IFERROR(VLOOKUP(D13,$Y$6:$AC$50,4,FALSE),\"\")","v":"女"},null,14,{"$f":"IFERROR(VLOOKUP(G13,$Y$6:$AC$50,4,FALSE),\"\")","v":"男"},null,15,{"$f":"IFERROR(VLOOKUP(J13,$Y$6:$AC$50,4,FALSE),\"\")","v":"男"},null,16,{"$f":"IFERROR(VLOOKUP(M13,$Y$6:$AC$50,4,FALSE),\"\")","v":"女"},null,17,{"$f":"IFERROR(VLOOKUP(P13,$Y$6:$AC$50,4,FALSE),\"\")","v":"女"},null,18,{"$f":"IFERROR(VLOOKUP(S13,$Y$6:$AC$50,4,FALSE),\"\")","v":"女"},null,null,null,1,8,108,{"$f":"VLOOKUP(座表!$Z13,[0]!all,AA$4,FALSE)","v":"木村　たけこ"},{"$f":"VLOOKUP(座表!$Z13,[0]!all,AB$4,FALSE)","v":"女"},{"$f":"VLOOKUP(座表!$Z13,[0]!all,AC$4,FALSE)","v":"キムラ　タケコ"}]
[null,null,null,{"$f":"IFERROR(VLOOKUP(D13,$Y$6:$AC$50,3,FALSE),\"\")","v":"重永　ともこ"},{"$f":"VLOOKUP($D$22,$Y$6:$AC$50,4,FALSE)","v":{"$error":"#N/A"}},null,{"$f":"IFERROR(VLOOKUP(G13,$Y$6:$AC$50,3,FALSE),\"\")","v":"須藤　はやと"},{"$f":"VLOOKUP($D$22,$Y$6:$AC$50,4,FALSE)","v":{"$error":"#N/A"}},null,{"$f":"IFERROR(VLOOKUP(J13,$Y$6:$AC$50,3,FALSE),\"\")","v":"白石　りきと"},{"$f":"VLOOKUP($D$22,$Y$6:$AC$50,4,FALSE)","v":{"$error":"#N/A"}},null,{"$f":"IFERROR(VLOOKUP(M13,$Y$6:$AC$50,3,FALSE),\"\")","v":"竹内　さちこ"},{"$f":"VLOOKUP($D$22,$Y$6:$AC$50,4,FALSE)","v":{"$error":"#N/A"}},null,{"$f":"IFERROR(VLOOKUP(P13,$Y$6:$AC$50,3,FALSE),\"\")","v":"田中　ゆめこ"},{"$f":"VLOOKUP($D$22,$Y$6:$AC$50,4,FALSE)","v":{"$error":"#N/A"}},null,{"$f":"IFERROR(VLOOKUP(S13,$Y$6:$AC$50,3,FALSE),\"\")","v":"土田　かおる"},{"$f":"VLOOKUP($D$22,$Y$6:$AC$50,4,FALSE)","v":{"$error":"#N/A"}},null,null,null,1,9,109,{"$f":"VLOOKUP(座表!$Z14,[0]!all,AA$4,FALSE)","v":"工藤　はなこ"},{"$f":"VLOOKUP(座表!$Z14,[0]!all,AB$4,FALSE)","v":"女"},{"$f":"VLOOKUP(座表!$Z14,[0]!all,AC$4,FALSE)","v":"クドウ　ハナコ"}]
[null,null,null,{"$f":"IFERROR(VLOOKUP(D13,$Y$6:$AC$50,5,FALSE),\"\")","v":"シゲナガ　トモコ"},{"$error":"#N/A"},null,{"$f":"IFERROR(VLOOKUP(G13,$Y$6:$AC$50,5,FALSE),\"\")","v":"スドウ　ハヤト"},{"$error":"#N/A"},null,{"$f":"IFERROR(VLOOKUP(J13,$Y$6:$AC$50,5,FALSE),\"\")","v":"シライシ　リキト"},{"$error":"#N/A"},null,{"$f":"IFERROR(VLOOKUP(M13,$Y$6:$AC$50,5,FALSE),\"\")","v":"タケウチ　サチコ"},{"$error":"#N/A"},null,{"$f":"IFERROR(VLOOKUP(P13,$Y$6:$AC$50,5,FALSE),\"\")","v":"タナカ　ユメコ"},{"$error":"#N/A"},null,{"$f":"IFERROR(VLOOKUP(S13,$Y$6:$AC$50,5,FALSE),\"\")","v":"ツチダ　カオル"},{"$error":"#N/A"},null,null,null,1,10,110,{"$f":"VLOOKUP(座表!$Z15,[0]!all,AA$4,FALSE)","v":"煙巻　そのこ"},{"$f":"VLOOKUP(座表!$Z15,[0]!all,AB$4,FALSE)","v":"女"},{"$f":"VLOOKUP(座表!$Z15,[0]!all,AC$4,FALSE)","v":"ケムマ　ソノコ"}]
[null,null,null,19,{"$f":"IFERROR(VLOOKUP(D16,$Y$6:$AC$50,4,FALSE),\"\")","v":"男"},null,20,{"$f":"IFERROR(VLOOKUP(G16,$Y$6:$AC$50,4,FALSE),\"\")","v":"男"},null,21,{"$f":"IFERROR(VLOOKUP(J16,$Y$6:$AC$50,4,FALSE),\"\")","v":"女"},null,22,{"$f":"IFERROR(VLOOKUP(M16,$Y$6:$AC$50,4,FALSE),\"\")","v":"女"},null,23,{"$f":"IFERROR(VLOOKUP(P16,$Y$6:$AC$50,4,FALSE),\"\")","v":"女"},null,24,{"$f":"IFERROR(VLOOKUP(S16,$Y$6:$AC$50,4,FALSE),\"\")","v":"女"},null,null,null,1,11,111,{"$f":"VLOOKUP(座表!$Z16,[0]!all,AA$4,FALSE)","v":"近藤　ゆいこ"},{"$f":"VLOOKUP(座表!$Z16,[0]!all,AB$4,FALSE)","v":"女"},{"$f":"VLOOKUP(座表!$Z16,[0]!all,AC$4,FALSE)","v":"コンドウ　ユイコ"}]
[null,null,null,{"$f":"IFERROR(VLOOKUP(D16,$Y$6:$AC$50,3,FALSE),\"\")","v":"中村　かおり"},{"$f":"VLOOKUP($D$22,$Y$6:$AC$50,4,FALSE)","v":{"$error":"#N/A"}},null,{"$f":"IFERROR(VLOOKUP(G16,$Y$6:$AC$50,3,FALSE),\"\")","v":"新沼　けんた"},{"$f":"VLOOKUP($D$22,$Y$6:$AC$50,4,FALSE)","v":{"$error":"#N/A"}},null,{"$f":"IFERROR(VLOOKUP(J16,$Y$6:$AC$50,3,FALSE),\"\")","v":"野口　ゆい"},{"$f":"VLOOKUP($D$22,$Y$6:$AC$50,4,FALSE)","v":{"$error":"#N/A"}},null,{"$f":"IFERROR(VLOOKUP(M16,$Y$6:$AC$50,3,FALSE),\"\")","v":"林　そのこ"},{"$f":"VLOOKUP($D$22,$Y$6:$AC$50,4,FALSE)","v":{"$error":"#N/A"}},null,{"$f":"IFERROR(VLOOKUP(P16,$Y$6:$AC$50,3,FALSE),\"\")","v":"平山　あゆ"},{"$f":"VLOOKUP($D$22,$Y$6:$AC$50,4,FALSE)","v":{"$error":"#N/A"}},null,{"$f":"IFERROR(VLOOKUP(S16,$Y$6:$AC$50,3,FALSE),\"\")","v":"藤木　ゆい"},{"$f":"VLOOKUP($D$22,$Y$6:$AC$50,4,FALSE)","v":{"$error":"#N/A"}},null,null,null,1,12,112,{"$f":"VLOOKUP(座表!$Z17,[0]!all,AA$4,FALSE)","v":"佐藤　はると"},{"$f":"VLOOKUP(座表!$Z17,[0]!all,AB$4,FALSE)","v":"男"},{"$f":"VLOOKUP(座表!$Z17,[0]!all,AC$4,FALSE)","v":"サトウ　ハルト"}]
[null,null,null,{"$f":"IFERROR(VLOOKUP(D16,$Y$6:$AC$50,5,FALSE),\"\")","v":"ナカムラ　カオリ"},{"$error":"#N/A"},null,{"$f":"IFERROR(VLOOKUP(G16,$Y$6:$AC$50,5,FALSE),\"\")","v":"ニイヌマ　ケンタ"},{"$error":"#N/A"},null,{"$f":"IFERROR(VLOOKUP(J16,$Y$6:$AC$50,5,FALSE),\"\")","v":"ノグチ　ユイ"},{"$error":"#N/A"},null,{"$f":"IFERROR(VLOOKUP(M16,$Y$6:$AC$50,5,FALSE),\"\")","v":"ハヤシ　ソノコ"},{"$error":"#N/A"},null,{"$f":"IFERROR(VLOOKUP(P16,$Y$6:$AC$50,5,FALSE),\"\")","v":"ヒラヤマ　アユ"},{"$error":"#N/A"},null,{"$f":"IFERROR(VLOOKUP(S16,$Y$6:$AC$50,5,FALSE),\"\")","v":"フジキ　ユイ"},{"$error":"#N/A"},null,null,null,1,13,113,{"$f":"VLOOKUP(座表!$Z18,[0]!all,AA$4,FALSE)","v":"重永　ともこ"},{"$f":"VLOOKUP(座表!$Z18,[0]!all,AB$4,FALSE)","v":"女"},{"$f":"VLOOKUP(座表!$Z18,[0]!all,AC$4,FALSE)","v":"シゲナガ　トモコ"}]
[null,null,null,25,{"$f":"IFERROR(VLOOKUP(D19,$Y$6:$AC$50,4,FALSE),\"\")","v":"男"},null,26,{"$f":"IFERROR(VLOOKUP(G19,$Y$6:$AC$50,4,FALSE),\"\")","v":"男"},null,27,{"$f":"IFERROR(VLOOKUP(J19,$Y$6:$AC$50,4,FALSE),\"\")","v":"女"},null,28,{"$f":"IFERROR(VLOOKUP(M19,$Y$6:$AC$50,4,FALSE),\"\")","v":"男"},null,29,{"$f":"IFERROR(VLOOKUP(P19,$Y$6:$AC$50,4,FALSE),\"\")","v":"女"},null,30,{"$f":"IFERROR(VLOOKUP(S19,$Y$6:$AC$50,4,FALSE),\"\")","v":"男"},null,null,null,1,14,114,{"$f":"VLOOKUP(座表!$Z19,[0]!all,AA$4,FALSE)","v":"須藤　はやと"},{"$f":"VLOOKUP(座表!$Z19,[0]!all,AB$4,FALSE)","v":"男"},{"$f":"VLOOKUP(座表!$Z19,[0]!all,AC$4,FALSE)","v":"スドウ　ハヤト"}]
[null,null,null,{"$f":"IFERROR(VLOOKUP(D19,$Y$6:$AC$50,3,FALSE),\"\")","v":"本庄　さとる"},{"$f":"VLOOKUP($D$22,$Y$6:$AC$50,4,FALSE)","v":{"$error":"#N/A"}},null,{"$f":"IFERROR(VLOOKUP(G19,$Y$6:$AC$50,3,FALSE),\"\")","v":"松永　とおる"},{"$f":"VLOOKUP($D$22,$Y$6:$AC$50,4,FALSE)","v":{"$error":"#N/A"}},null,{"$f":"IFERROR(VLOOKUP(J19,$Y$6:$AC$50,3,FALSE),\"\")","v":"三島　けいこ"},{"$f":"VLOOKUP($D$22,$Y$6:$AC$50,4,FALSE)","v":{"$error":"#N/A"}},null,{"$f":"IFERROR(VLOOKUP(M19,$Y$6:$AC$50,3,FALSE),\"\")","v":"武藤　かい"},{"$f":"VLOOKUP($D$22,$Y$6:$AC$50,4,FALSE)","v":{"$error":"#N/A"}},null,{"$f":"IFERROR(VLOOKUP(P19,$Y$6:$AC$50,3,FALSE),\"\")","v":"目下　あおい"},{"$f":"VLOOKUP($D$22,$Y$6:$AC$50,4,FALSE)","v":{"$error":"#N/A"}},null,{"$f":"IFERROR(VLOOKUP(S19,$Y$6:$AC$50,3,FALSE),\"\")","v":"山下　かい"},{"$f":"VLOOKUP($D$22,$Y$6:$AC$50,4,FALSE)","v":{"$error":"#N/A"}},null,null,null,1,15,115,{"$f":"VLOOKUP(座表!$Z20,[0]!all,AA$4,FALSE)","v":"白石　りきと"},{"$f":"VLOOKUP(座表!$Z20,[0]!all,AB$4,FALSE)","v":"男"},{"$f":"VLOOKUP(座表!$Z20,[0]!all,AC$4,FALSE)","v":"シライシ　リキト"}]
[null,null,null,{"$f":"IFERROR(VLOOKUP(D19,$Y$6:$AC$50,5,FALSE),\"\")","v":"ホンジョウ　サトル"},{"$error":"#N/A"},null,{"$f":"IFERROR(VLOOKUP(G19,$Y$6:$AC$50,5,FALSE),\"\")","v":"マツナガ　トオル"},{"$error":"#N/A"},null,{"$f":"IFERROR(VLOOKUP(J19,$Y$6:$AC$50,5,FALSE),\"\")","v":"ミシマ　ケイコ"},{"$error":"#N/A"},null,{"$f":"IFERROR(VLOOKUP(M19,$Y$6:$AC$50,5,FALSE),\"\")","v":"ムトウ　カイ"},{"$error":"#N/A"},null,{"$f":"IFERROR(VLOOKUP(P19,$Y$6:$AC$50,5,FALSE),\"\")","v":"メシタ　アオイ"},{"$error":"#N/A"},null,{"$f":"IFERROR(VLOOKUP(S19,$Y$6:$AC$50,5,FALSE),\"\")","v":"ヤマシタ　カイ"},{"$error":"#N/A"},null,null,null,1,16,116,{"$f":"VLOOKUP(座表!$Z21,[0]!all,AA$4,FALSE)","v":"竹内　さちこ"},{"$f":"VLOOKUP(座表!$Z21,[0]!all,AB$4,FALSE)","v":"女"},{"$f":"VLOOKUP(座表!$Z21,[0]!all,AC$4,FALSE)","v":"タケウチ　サチコ"}]
[null,null,null,null,{"$f":"IFERROR(VLOOKUP(D22,$Y$6:$AC$50,4,FALSE),\"\")","v":""},null,null,{"$f":"IFERROR(VLOOKUP(G22,$Y$6:$AC$50,4,FALSE),\"\")","v":""},null,null,{"$f":"IFERROR(VLOOKUP(J22,$Y$6:$AC$50,4,FALSE),\"\")","v":""},null,null,{"$f":"IFERROR(VLOOKUP(M22,$Y$6:$AC$50,4,FALSE),\"\")","v":""},null,null,{"$f":"IFERROR(VLOOKUP(P22,$Y$6:$AC$50,4,FALSE),\"\")","v":""},null,null,{"$f":"IFERROR(VLOOKUP(S22,$Y$6:$AC$50,4,FALSE),\"\")","v":""},null,null,null,1,17,117,{"$f":"VLOOKUP(座表!$Z22,[0]!all,AA$4,FALSE)","v":"田中　ゆめこ"},{"$f":"VLOOKUP(座表!$Z22,[0]!all,AB$4,FALSE)","v":"女"},{"$f":"VLOOKUP(座表!$Z22,[0]!all,AC$4,FALSE)","v":"タナカ　ユメコ"}]
[null,null,null,{"$f":"IFERROR(VLOOKUP(D22,$Y$6:$AC$50,3,FALSE),\"\")","v":""},{"$f":"VLOOKUP($D$22,$Y$6:$AC$50,4,FALSE)","v":{"$error":"#N/A"}},null,{"$f":"IFERROR(VLOOKUP(G22,$Y$6:$AC$50,3,FALSE),\"\")","v":""},{"$f":"VLOOKUP($D$22,$Y$6:$AC$50,4,FALSE)","v":{"$error":"#N/A"}},null,{"$f":"IFERROR(VLOOKUP(J22,$Y$6:$AC$50,3,FALSE),\"\")","v":""},{"$f":"VLOOKUP($D$22,$Y$6:$AC$50,4,FALSE)","v":{"$error":"#N/A"}},null,{"$f":"IFERROR(VLOOKUP(M22,$Y$6:$AC$50,3,FALSE),\"\")","v":""},{"$f":"VLOOKUP($D$22,$Y$6:$AC$50,4,FALSE)","v":{"$error":"#N/A"}},null,{"$f":"IFERROR(VLOOKUP(P22,$Y$6:$AC$50,3,FALSE),\"\")","v":""},{"$f":"VLOOKUP($D$22,$Y$6:$AC$50,4,FALSE)","v":{"$error":"#N/A"}},null,{"$f":"IFERROR(VLOOKUP(S22,$Y$6:$AC$50,3,FALSE),\"\")","v":""},{"$f":"VLOOKUP($D$22,$Y$6:$AC$50,4,FALSE)","v":{"$error":"#N/A"}},null,null,null,1,18,118,{"$f":"VLOOKUP(座表!$Z23,[0]!all,AA$4,FALSE)","v":"土田　かおる"},{"$f":"VLOOKUP(座表!$Z23,[0]!all,AB$4,FALSE)","v":"女"},{"$f":"VLOOKUP(座表!$Z23,[0]!all,AC$4,FALSE)","v":"ツチダ　カオル"}]
[null,null,null,{"$f":"IFERROR(VLOOKUP(D22,$Y$6:$AC$50,5,FALSE),\"\")","v":""},{"$error":"#N/A"},null,{"$f":"IFERROR(VLOOKUP(G22,$Y$6:$AC$50,5,FALSE),\"\")","v":""},{"$error":"#N/A"},null,{"$f":"IFERROR(VLOOKUP(J22,$Y$6:$AC$50,5,FALSE),\"\")","v":""},{"$error":"#N/A"},null,{"$f":"IFERROR(VLOOKUP(M22,$Y$6:$AC$50,5,FALSE),\"\")","v":""},{"$error":"#N/A"},null,{"$f":"IFERROR(VLOOKUP(P22,$Y$6:$AC$50,5,FALSE),\"\")","v":""},{"$error":"#N/A"},null,{"$f":"IFERROR(VLOOKUP(S22,$Y$6:$AC$50,5,FALSE),\"\")","v":""},{"$error":"#N/A"},null,null,null,1,19,119,{"$f":"VLOOKUP(座表!$Z24,[0]!all,AA$4,FALSE)","v":"中村　かおり"},{"$f":"VLOOKUP(座表!$Z24,[0]!all,AB$4,FALSE)","v":"男"},{"$f":"VLOOKUP(座表!$Z24,[0]!all,AC$4,FALSE)","v":"ナカムラ　カオリ"}]
[null,null,null,null,{"$f":"IFERROR(VLOOKUP(D25,$Y$6:$AC$50,4,FALSE),\"\")","v":""},null,null,{"$f":"IFERROR(VLOOKUP(G25,$Y$6:$AC$50,4,FALSE),\"\")","v":""},null,null,{"$f":"IFERROR(VLOOKUP(J25,$Y$6:$AC$50,4,FALSE),\"\")","v":""},null,null,{"$f":"IFERROR(VLOOKUP(M25,$Y$6:$AC$50,4,FALSE),\"\")","v":""},null,null,{"$f":"IFERROR(VLOOKUP(P25,$Y$6:$AC$50,4,FALSE),\"\")","v":""},null,null,{"$f":"IFERROR(VLOOKUP(S25,$Y$6:$AC$50,4,FALSE),\"\")","v":""},null,null,null,1,20,120,{"$f":"VLOOKUP(座表!$Z25,[0]!all,AA$4,FALSE)","v":"新沼　けんた"},{"$f":"VLOOKUP(座表!$Z25,[0]!all,AB$4,FALSE)","v":"男"},{"$f":"VLOOKUP(座表!$Z25,[0]!all,AC$4,FALSE)","v":"ニイヌマ　ケンタ"}]
[null,null,null,{"$f":"IFERROR(VLOOKUP(D25,$Y$6:$AC$50,3,FALSE),\"\")","v":""},{"$error":"#N/A"},null,{"$f":"IFERROR(VLOOKUP(G25,$Y$6:$AC$50,3,FALSE),\"\")","v":""},{"$error":"#N/A"},null,{"$f":"IFERROR(VLOOKUP(J25,$Y$6:$AC$50,3,FALSE),\"\")","v":""},{"$error":"#N/A"},null,{"$f":"IFERROR(VLOOKUP(M25,$Y$6:$AC$50,3,FALSE),\"\")","v":""},{"$error":"#N/A"},null,{"$f":"IFERROR(VLOOKUP(P25,$Y$6:$AC$50,3,FALSE),\"\")","v":""},{"$error":"#N/A"},null,{"$f":"IFERROR(VLOOKUP(S25,$Y$6:$AC$50,3,FALSE),\"\")","v":""},{"$error":"#N/A"},null,null,null,1,21,121,{"$f":"VLOOKUP(座表!$Z26,[0]!all,AA$4,FALSE)","v":"野口　ゆい"},{"$f":"VLOOKUP(座表!$Z26,[0]!all,AB$4,FALSE)","v":"女"},{"$f":"VLOOKUP(座表!$Z26,[0]!all,AC$4,FALSE)","v":"ノグチ　ユイ"}]
[null,null,null,{"$f":"IFERROR(VLOOKUP(D25,$Y$6:$AC$50,5,FALSE),\"\")","v":""},{"$error":"#N/A"},null,{"$f":"IFERROR(VLOOKUP(G25,$Y$6:$AC$50,5,FALSE),\"\")","v":""},{"$error":"#N/A"},null,{"$f":"IFERROR(VLOOKUP(J25,$Y$6:$AC$50,5,FALSE),\"\")","v":""},{"$error":"#N/A"},null,{"$f":"IFERROR(VLOOKUP(M25,$Y$6:$AC$50,5,FALSE),\"\")","v":""},{"$error":"#N/A"},null,{"$f":"IFERROR(VLOOKUP(P25,$Y$6:$AC$50,5,FALSE),\"\")","v":""},{"$error":"#N/A"},null,{"$f":"IFERROR(VLOOKUP(S25,$Y$6:$AC$50,5,FALSE),\"\")","v":""},{"$error":"#N/A"},null,null,null,1,22,122,{"$f":"VLOOKUP(座表!$Z27,[0]!all,AA$4,FALSE)","v":"林　そのこ"},{"$f":"VLOOKUP(座表!$Z27,[0]!all,AB$4,FALSE)","v":"女"},{"$f":"VLOOKUP(座表!$Z27,[0]!all,AC$4,FALSE)","v":"ハヤシ　ソノコ"}]
[null,null,null,null,null,null,null,null,null,null,null,null,null,null,null,null,null,null,null,null,null,null,null,1,23,123,{"$f":"VLOOKUP(座表!$Z28,[0]!all,AA$4,FALSE)","v":"平山　あゆ"},{"$f":"VLOOKUP(座表!$Z28,[0]!all,AB$4,FALSE)","v":"女"},{"$f":"VLOOKUP(座表!$Z28,[0]!all,AC$4,FALSE)","v":"ヒラヤマ　アユ"}]
[null,null,null,null,null,null,null,null,null,"教　　卓",null,null,null,null,null,null,null,null,{"$f":"$Z$3","v":0},null,null,null,null,1,24,124,{"$f":"VLOOKUP(座表!$Z29,[0]!all,AA$4,FALSE)","v":"藤木　ゆい"},{"$f":"VLOOKUP(座表!$Z29,[0]!all,AB$4,FALSE)","v":"女"},{"$f":"VLOOKUP(座表!$Z29,[0]!all,AC$4,FALSE)","v":"フジキ　ユイ"}]
[null,null,null,null,null,null,null,null,null,null,null,null,null,null,null,null,null,null,"クラス担任",null,null,null,null,1,25,125,{"$f":"VLOOKUP(座表!$Z30,[0]!all,AA$4,FALSE)","v":"本庄　さとる"},{"$f":"VLOOKUP(座表!$Z30,[0]!all,AB$4,FALSE)","v":"男"},{"$f":"VLOOKUP(座表!$Z30,[0]!all,AC$4,FALSE)","v":"ホンジョウ　サトル"}]
{"$rows_left_out":32}